BDBM9938 depeptidized alpha-ketoamide inhibitor 34
SMILES CC(C)COC(=O)N[C@@H](C1CCCCC1)C(=O)N(C)[C@@H](CC1CC1)C(=O)NC(CC1CC1)C(=O)C(=O)NCC(=O)N[C@H](C(=O)N(C)C)c1ccccc1
InChI Key InChIKey=ZPKDOCXSELIIGV-OMVUIKPJSA-N
Data  1 KI
  Tab Delimited (TSV)   2D SDfile   Computed 3D by Vconf -m prep SDfile
Find this compound or compounds like it in BindingDB:
Activity Spreadsheet -- Enzyme Inhibition Constant Data from BindingDB
Found 1 hit for monomerid = 9938
TargetGenome polyprotein(Hepatitis C virus (HCV genotype 1a, isolate H))
Schering-Plough Research Institute
LigandPNGBDBM9938(depeptidized alpha-ketoamide inhibitor 34)
Affinity DataKi:  60nM ΔG°:  -10.0kcal/molepH: 6.5 T: 2°C. Assay description: Proteolytic cleavage of the ester linkage between the Nva (L-norvaline) and the chromophore (PAP) was monitored for change in absorbance at 370 nm. I...
In DepthDetails ArticlePubMed