BDBM99938 US8501729, 34
SMILES Cn1cc2CCN([C@H]3CN4CCC3CC4)C(=O)c3cccc1c23
InChI Key InChIKey=IANJVKHDSMUIRT-KRWDZBQOSA-N
Data  1 KI
  Tab Delimited (TSV)   2D SDfile   Computed 3D by Vconf -m prep SDfile
Find this compound or compounds like it in BindingDB:
Activity Spreadsheet -- Enzyme Inhibition Constant Data from BindingDB
Found 1 hit for monomerid = 99938
Target5-hydroxytryptamine receptor 3A(Homo sapiens (Human))
Albany Molecular Research
US Patent
LigandPNGBDBM99938(US8501729, 34)
Affinity DataKi:  8nMpH: 7.5Assay Description:The relative affinity of the various compounds for the human 5-HT3 receptor was measured in a radioligand binding assay, using a scintillation proxim...
In DepthDetails US Patent