Target
Phosphatidylinositol 4,5-bisphosphate 3-kinase catalytic subunit delta isoform
Ligand
BDBM506865
Substrate
Meas. Tech.
PI3Kdelta Scintillation Proximity Assay
IC50
<100±n/a nM
Citation
 Douty, BAi, YBurns, DMCombs, APFalahatpisheh, NLevy, DPolam, PShao, LShepard, SShvartsbart, AYue, EWBuesking, AW Aminopyrazine derivatives as PI3K-γ inhibitors US Patent  US11046658 Publication Date 6/29/2021 
Target
Name:
Phosphatidylinositol 4,5-bisphosphate 3-kinase catalytic subunit delta isoform
Synonyms:
PI3-kinase p110 subunit delta PI3-kinase subunit p110-delta PIK3CD Phosphatidylinositol 4,5-biphosphate 3-kinase catalytic subunit delta (PIK3CD) Phosphatidylinositol 4,5-bisphosphate 3-kinase 110 kDa catalytic subunit delta (PI3K delta) Phosphatidylinositol 4,5-bisphosphate 3-kinase catalytic subunit delta (PI3Kdelta) Phosphatidylinositol 4,5-bisphosphate 3-kinase catalytic subunit delta isoform (PI3K delta) Phosphatidylinositol 4,5-bisphosphate 3-kinase catalytic subunit delta isoform (PI3K-delta) Phosphatidylinositol 4,5-bisphosphate 3-kinase catalytic subunit delta isoform (PI3Kdelta)
Type:
Enzyme Subunit
Mol. Mass.:
119489.41
Organism:
Homo sapiens (Human)
Description:
O00329
Residue:
1044
  
Inhibitor
Name:
BDBM506865
Synonyms:
3-amino-6-(5-(3-amino- 1,1,1-trifluoro-2-hydroxy- 3-oxopropan-2-yl)-2- methylphenyl)-N-((S)-1- cyanobutan-2-yl)pyrazine- 2-carboxamide trifluoroacetate | US11046658, Example 20
Type:
Small organic molecule
Emp. Form.:
C20H21F3N6O3
Mol. Mass.:
450.4143
SMILES:
CC[C@@H](CC#N)NC(=O)c1nc(cnc1N)-c1cc(ccc1C)C(O)(C(N)=O)C(F)(F)F
: