Target
Phosphatidylinositol 4,5-bisphosphate 3-kinase catalytic subunit delta isoform
Ligand
BDBM506974
Substrate
Meas. Tech.
PI3Kdelta Scintillation Proximity Assay
IC50
<100±n/a nM
Citation
 Douty, BAi, YBurns, DMCombs, APFalahatpisheh, NLevy, DPolam, PShao, LShepard, SShvartsbart, AYue, EWBuesking, AW Aminopyrazine derivatives as PI3K-γ inhibitors US Patent  US11046658 Publication Date 6/29/2021 
Target
Name:
Phosphatidylinositol 4,5-bisphosphate 3-kinase catalytic subunit delta isoform
Synonyms:
PI3-kinase p110 subunit delta PI3-kinase subunit p110-delta PIK3CD Phosphatidylinositol 4,5-biphosphate 3-kinase catalytic subunit delta (PIK3CD) Phosphatidylinositol 4,5-bisphosphate 3-kinase 110 kDa catalytic subunit delta (PI3K delta) Phosphatidylinositol 4,5-bisphosphate 3-kinase catalytic subunit delta (PI3Kdelta) Phosphatidylinositol 4,5-bisphosphate 3-kinase catalytic subunit delta isoform (PI3K delta) Phosphatidylinositol 4,5-bisphosphate 3-kinase catalytic subunit delta isoform (PI3K-delta) Phosphatidylinositol 4,5-bisphosphate 3-kinase catalytic subunit delta isoform (PI3Kdelta)
Type:
Enzyme Subunit
Mol. Mass.:
119489.41
Organism:
Homo sapiens (Human)
Description:
O00329
Residue:
1044
  
Inhibitor
Name:
BDBM506974
Synonyms:
2-(3-(5-amino-6-(4-(3- cyanopyrazin-2-yl)piperazin-1- yl)pyrazin-2-yl)-4-methylphenyl)- 3,3,3-trifluoro-2- hydroxypropanamide trifluoroacetate | US11046658, Example 128
Type:
Small organic molecule
Emp. Form.:
C23H22F3N9O2
Mol. Mass.:
513.4751
SMILES:
Cc1ccc(cc1-c1cnc(N)c(n1)N1CCN(CC1)c1nccnc1C#N)C(O)(C(N)=O)C(F)(F)F
: