Target
Transient receptor potential cation channel subfamily M member 8
Ligand
BDBM507016
Substrate
IC50
388±n/a nM
Citation
 Aramini, ABianchini, GBrandolini, LBeccari, ALillini, SNano, G 2-aryl-4-hydroxy-1,3-thiazole derivatives useful as TRPM8-inhibitors in treatment of neuralgia, pain, COPD and asthma US Patent  US11046662 Publication Date 6/29/2021 
Target
Name:
Transient receptor potential cation channel subfamily M member 8
Synonyms:
LTRPC6 TRPM8_HUMAN Transient receptor potential M8 protein (TRPM8) Transient receptor potential cation channel subfamily M member 8 (TRPM8)
Type:
Enzyme
Mol. Mass.:
127693.26
Organism:
Homo sapiens (Human)
Description:
Q7Z2W7
Residue:
1104
  
Inhibitor
Name:
BDBM507016
Synonyms:
2-(3-fluorophenyl)-4-hydroxy-N- methoxy-N-methyl-1,3-thiazole-5- carbothioamide | US11046662, Compound 41
Type:
Small organic molecule
Emp. Form.:
C12H11FN2O2S2
Mol. Mass.:
298.356
SMILES:
CON(C)C(=S)c1sc(nc1O)-c1cccc(F)c1
: