Target
Sigma non-opioid intracellular receptor 1
Ligand
BDBM507022
Substrate
Meas. Tech.
Receptor Binding Assays
Ki
>10000±n/a nM
Citation
 Martin, SFSahn, JJHodges, TR Piperazinyl norbenzomorphan compounds and methods for using the same US Patent  US11046670 Publication Date 6/29/2021 
Target
Name:
Sigma non-opioid intracellular receptor 1
Synonyms:
Aging-associated gene 8 protein SGMR1_HUMAN SIGMAR1 SR31747-binding protein Sigma 1-type opioid receptor Sigma1R | hSigmaR1
Type:
Enzyme Catalytic Domain
Mol. Mass.:
25124.85
Organism:
Homo sapiens (Human)
Description:
Q99720
Residue:
223
  
Inhibitor
Name:
BDBM507022
Synonyms:
US11046670, Compound 16
Type:
Small organic molecule
Emp. Form.:
C23H26N2O3
Mol. Mass.:
378.4641
SMILES:
O=C(OCc1ccccc1)N1CC[C@@H]2C[C@@H]1c1cc(ccc21)N1CCOCC1
: