Target
Sigma intracellular receptor 2
Ligand
BDBM507025
Substrate
Ki
1258±n/a nM
Citation
 Martin, SFSahn, JJHodges, TR Piperazinyl norbenzomorphan compounds and methods for using the same US Patent  US11046670 Publication Date 6/29/2021 
Target
Name:
Sigma intracellular receptor 2
Synonyms:
MAC30 S2R Sigma-2 receptor TMEM97 | Transmembrane protein 97
Type:
Protein
Mol. Mass.:
20857.20
Organism:
Homo sapiens (Human)
Description:
Q5BJF2
Residue:
176
  
Inhibitor
Name:
BDBM507025
Synonyms:
US11046670, Compound 40
Type:
Small organic molecule
Emp. Form.:
C22H25FN2O
Mol. Mass.:
352.4451
SMILES:
Fc1ccccc1CN1CC[C@@H]2C[C@@H]1c1cc(ccc21)N1CCOCC1
: