Target
Sigma non-opioid intracellular receptor 1
Ligand
BDBM507040
Substrate
Meas. Tech.
Receptor Binding Assays
Ki
172±n/a nM
Citation
 Martin, SFSahn, JJHodges, TR Piperazinyl norbenzomorphan compounds and methods for using the same US Patent  US11046670 Publication Date 6/29/2021 
Target
Name:
Sigma non-opioid intracellular receptor 1
Synonyms:
Aging-associated gene 8 protein SGMR1_HUMAN SIGMAR1 SR31747-binding protein Sigma 1-type opioid receptor Sigma1R | hSigmaR1
Type:
Enzyme Catalytic Domain
Mol. Mass.:
25124.85
Organism:
Homo sapiens (Human)
Description:
Q99720
Residue:
223
  
Inhibitor
Name:
BDBM507040
Synonyms:
US11046670, Compound 29
Type:
Small organic molecule
Emp. Form.:
C27H33N3O2
Mol. Mass.:
431.5698
SMILES:
C=CCCN1CCN(CC1)c1ccc2[C@H]3C[C@@H](N(CC3)C(=O)OCc3ccccc3)c2c1
: