Target
Toll-like receptor 8
Ligand
BDBM507035
Substrate
Meas. Tech.
Pharmacological Test
EC50
3.00±n/a nM
Citation
 Dey, FWang, LYun, HZhang, WZhang, ZZhu, W Dihydropyrimidinyl benzazepine carboxamide compounds US Patent  US11046671 Publication Date 6/29/2021 
Target
Name:
Toll-like receptor 8
Synonyms:
CD_antigen: CD288 TLR8_HUMAN | TRL8
Type:
Enzyme
Mol. Mass.:
119828.77
Organism:
Homo sapiens (Human)
Description:
Q9NR97
Residue:
1041
  
Inhibitor
Name:
BDBM507035
Synonyms:
2-Amino-8-(1,4-dihydroquinazolin-2-yl)-N,N-dipropyl-3H-1-benzazepine-4-carboxamide | US11046671, Example 1
Type:
Small organic molecule
Emp. Form.:
C25H29N5O
Mol. Mass.:
415.5307
SMILES:
CCCN(CCC)C(=O)C1=Cc2ccc(cc2N=C(N)C1)C1=NCc2ccccc2N1
: