Target
Vascular endothelial growth factor receptor 2
Ligand
BDBM50026612
Substrate
Meas. Tech.
VEGFR2 Enzyme Inhibition
Ki
3.80±n/a nM
Citation
 Walters, IBirch, LHill-Cousins, JCollingwood, SPStevenson, CS Indolinones compounds and their use in the treatment of fibrotic diseases US Patent  US11046672 Publication Date 6/29/2021 
Target
Name:
Vascular endothelial growth factor receptor 2
Synonyms:
CD_antigen=CD309 Fetal liver kinase 1 (FLK-1) KDR Protein-tyrosine kinase receptor Flk-1 VEGFR-2 VEGFR2 Vascular Endothelial Growth Factor Receptor Kinase 2 Vascular endothelial growth factor receptor 2 (KDR) Vascular endothelial growth factor receptor 2 (VEGFR2) Vascular endothelial growth factor receptor-2 (VEGFR-2)
Type:
Receptor Tyrosine Kinase
Mol. Mass.:
151510.97
Organism:
Homo sapiens (Human)
Description:
P35968
Residue:
1356
  
Inhibitor
Name:
BDBM50026612
Synonyms:
BIBF-1120 US10981896, Compound Nintedanib US11208381, Nintedanib | Vargatef
Type:
Small organic molecule
Emp. Form.:
C31H33N5O4
Mol. Mass.:
539.6248
SMILES:
COC(=O)c1ccc2\C(=C(\Nc3ccc(cc3)N(C)C(=O)CN3CCN(C)CC3)c3ccccc3)C(=O)Nc2c1
: