Target
Platelet-derived growth factor receptor alpha
Ligand
BDBM507058
Substrate
Meas. Tech.
PDGFRalpha Enzyme Inhibition
Ki
8.80±n/a nM
Citation
 Walters, IBirch, LHill-Cousins, JCollingwood, SPStevenson, CS Indolinones compounds and their use in the treatment of fibrotic diseases US Patent  US11046672 Publication Date 6/29/2021 
Target
Name:
Platelet-derived growth factor receptor alpha
Synonyms:
Alpha-type platelet-derived growth factor receptor PDGFRA PGFRA_HUMAN Platelet-derived growth factor receptor alpha (PDGFRA) RHEPDGFRA
Type:
Protein
Mol. Mass.:
122633.38
Organism:
Homo sapiens (Human)
Description:
P16234
Residue:
1089
  
Inhibitor
Name:
BDBM507058
Synonyms:
(Z)-Methyl 3-(((4-((2-(4-(2-hydroxyethyl)piperazin-1-yl)ethoxy)carbamoyl)phenyl)amino)(phenyl)methylene)-5-methyl-2-oxoindoline-6-carboxylate, formate | US11046672, Example 7
Type:
Small organic molecule
Emp. Form.:
C33H37N5O6
Mol. Mass.:
599.6768
SMILES:
COC(=O)c1cc2NC(=O)\C(=C(/Nc3ccc(cc3)C(=O)NOCCN3CCN(CCO)CC3)c3ccccc3)c2cc1C
: