Target
Fibroblast growth factor receptor 3
Ligand
BDBM507069
Substrate
Meas. Tech.
FGFR3 Enzyme Inhibition
Ki
7.42±n/a nM
Citation
 Walters, IBirch, LHill-Cousins, JCollingwood, SPStevenson, CS Indolinones compounds and their use in the treatment of fibrotic diseases US Patent  US11046672 Publication Date 6/29/2021 
Target
Name:
Fibroblast growth factor receptor 3
Synonyms:
CD_antigen: CD333 FGFR3 Fibroblast growth factor receptor JTK4
Type:
Protein
Mol. Mass.:
87699.57
Organism:
Homo sapiens (Human)
Description:
P22607
Residue:
806
  
Inhibitor
Name:
BDBM507069
Synonyms:
US11046672, Example 18
Type:
Small organic molecule
Emp. Form.:
C33H37N5O5
Mol. Mass.:
583.6774
SMILES:
COC(=O)c1ccc2\C(=C(\Nc3ccc(C(=O)N(C)OCCN4CCN(C)CC4)c(C)c3)c3ccccc3)C(=O)Nc2c1
: