Target
Platelet-derived growth factor receptor beta
Ligand
BDBM507091
Substrate
Meas. Tech.
PDGFRbeta Enzyme Inhibition
Ki
7.66±n/a nM
Citation
 Walters, IBirch, LHill-Cousins, JCollingwood, SPStevenson, CS Indolinones compounds and their use in the treatment of fibrotic diseases US Patent  US11046672 Publication Date 6/29/2021 
Target
Name:
Platelet-derived growth factor receptor beta
Synonyms:
Beta-type platelet-derived growth factor receptor CD140b antigen PDGF Receptor Substrate PDGFR PDGFR-1 PDGFRB PGFRB_HUMAN Platelet-derived growth factor receptor 1 Platelet-derived growth factor receptor beta (PDGFR-beta) Platelet-derived growth factor receptor beta (PDGFRbeta) | VHL/PDGFRB
Type:
Enzyme
Mol. Mass.:
123922.25
Organism:
Homo sapiens (Human)
Description:
P09619
Residue:
1106
  
Inhibitor
Name:
BDBM507091
Synonyms:
US11046672, Example 40
Type:
Small organic molecule
Emp. Form.:
C31H32N4O6
Mol. Mass.:
556.609
SMILES:
COC(=O)c1ccc2\C(=C(\Nc3ccc(cc3)C(=O)NOCCN3CCC(O)CC3)c3ccccc3)C(=O)Nc2c1
: