Target
Apelin receptor
Ligand
BDBM507134
Substrate
Meas. Tech.
[35S]GTPgammaS Binding
EC50
4.10±n/a nM
Citation
 Chen, NChen, XChen, YCheng, ACConnors, RVDeignan, JDransfield, PJDu, XFu, ZHarvey, JSHeath, JAHeumann, LVHorne, DBHouze, JKaller, MRKayser, FKhakoo, AYKopecky, DJLai, SMa, ZMedina, JCMihalic, JTNishimura, NOlson, SHPattaropong, VSwaminath, GWang, XWanska, MYang, KYeh, W Heteroaryl-substituted triazoles as APJ receptor agonists US Patent  US11046680 Publication Date 6/29/2021 
Target
Name:
Apelin receptor
Synonyms:
AGTRL1 APJ_HUMAN Angiotensin receptor-like 1 Apelin receptor (APJ) G-protein coupled receptor HG11
Type:
Enzyme Catalytic Domain
Mol. Mass.:
42664.06
Organism:
Homo sapiens (Human)
Description:
P35414
Residue:
380
  
Inhibitor
Name:
BDBM507134
Synonyms:
US11046680, Example 5.0
Type:
Small organic molecule
Emp. Form.:
C21H25N9O5S2
Mol. Mass.:
547.611
SMILES:
CO[C@@H]([C@H](C)S(=O)(=O)Nc1nnc(-c2csc(C)n2)n1-c1c(OC)ncnc1OC)c1ncc(C)cn1
: