Target
Apelin receptor
Ligand
BDBM507308
Substrate
Meas. Tech.
[35S]GTPgammaS Binding
EC50
140±n/a nM
Citation
 Chen, NChen, XChen, YCheng, ACConnors, RVDeignan, JDransfield, PJDu, XFu, ZHarvey, JSHeath, JAHeumann, LVHorne, DBHouze, JKaller, MRKayser, FKhakoo, AYKopecky, DJLai, SMa, ZMedina, JCMihalic, JTNishimura, NOlson, SHPattaropong, VSwaminath, GWang, XWanska, MYang, KYeh, W Heteroaryl-substituted triazoles as APJ receptor agonists US Patent  US11046680 Publication Date 6/29/2021 
Target
Name:
Apelin receptor
Synonyms:
AGTRL1 APJ_HUMAN Angiotensin receptor-like 1 Apelin receptor (APJ) G-protein coupled receptor HG11
Type:
Enzyme Catalytic Domain
Mol. Mass.:
42664.06
Organism:
Homo sapiens (Human)
Description:
P35414
Residue:
380
  
Inhibitor
Name:
BDBM507308
Synonyms:
US11046680, Example 187.0 US11046680, Example 196.0
Type:
Small organic molecule
Emp. Form.:
C20H20FN7O5S
Mol. Mass.:
489.48
SMILES:
COc1cccc(OC)c1-n1c(NS(=O)(=O)[C@H](C)Cc2ncc(F)cn2)nnc1-c1cocn1
: