Target
Ubiquitin carboxyl-terminal hydrolase 7
Ligand
BDBM507631
Substrate
Meas. Tech.
Evaluation of the Inhibition of USP7 by the Fluorescence Intensity (FLINT) Readings
IC50
406±n/a nM
Citation
 Kotschy, AWéber, CVasas, AMolnár, BKiss, nullMacias, AMurray, JBLewkowicz, EGeneste, OChanrion, MDemarles, D Substituted piperidines for the treatment of cancer US Patent  US11046681 Publication Date 6/29/2021 
Target
Name:
Ubiquitin carboxyl-terminal hydrolase 7
Synonyms:
Deubiquitinating enzyme 7 Herpesvirus-associated ubiquitin-specific protease USP7 Ubiquitin-specific-processing protease 7
Type:
PROTEIN
Mol. Mass.:
128274.45
Organism:
Homo sapiens (Human)
Description:
ChEMBL_1469483
Residue:
1102
  
Inhibitor
Name:
BDBM507631
Synonyms:
3-[[1-[(3R,4R)-1-acetyl-3-phenyl-piperidine-4-carbonyl]-4-hydroxy-4-piperidyl]methyl]-7-phenyl-pyrrolo[2,3-d]pyrimidin-4-one | US11046681, Example 147
Type:
Small organic molecule
Emp. Form.:
C32H35N5O4
Mol. Mass.:
553.6514
SMILES:
CC(=O)N1CC[C@H]([C@@H](C1)c1ccccc1)C(=O)N1CCC(O)(Cn2cnc3n(ccc3c2=O)-c2ccccc2)CC1
: