Target
Indoleamine 2,3-dioxygenase 1
Ligand
BDBM507663
Substrate
Meas. Tech.
IDO Enzyme Activity Inhibition Testing
IC50
<250±n/a nM
Citation
 Chen, XGao, Y Fused heterocyclic derivatives, their preparation methods thereof and medical uses thereof US Patent  US11046682 Publication Date 6/29/2021 
Target
Name:
Indoleamine 2,3-dioxygenase 1
Synonyms:
I23O1_HUMAN IDO-1 INDO Indoleamine 2,3-dioxygenase | Indoleamine-pyrrole 2,3-dioxygenase
Type:
Enzyme
Mol. Mass.:
45330.80
Organism:
Homo sapiens (Human)
Description:
P14902
Residue:
403
  
Inhibitor
Name:
BDBM507663
Synonyms:
US11046682, Compound 32
Type:
Small organic molecule
Emp. Form.:
C20H14N6O
Mol. Mass.:
354.3648
SMILES:
O=C(Nc1ccc(nc1)C#N)Nc1c(ccc2cncn12)-c1ccccc1
: