Target
Indoleamine 2,3-dioxygenase 1
Ligand
BDBM507668
Substrate
Meas. Tech.
IDO Enzyme Activity Inhibition Testing
IC50
875±n/a nM
Citation
 Chen, XGao, Y Fused heterocyclic derivatives, their preparation methods thereof and medical uses thereof US Patent  US11046682 Publication Date 6/29/2021 
Target
Name:
Indoleamine 2,3-dioxygenase 1
Synonyms:
I23O1_HUMAN IDO-1 INDO Indoleamine 2,3-dioxygenase | Indoleamine-pyrrole 2,3-dioxygenase
Type:
Enzyme
Mol. Mass.:
45330.80
Organism:
Homo sapiens (Human)
Description:
P14902
Residue:
403
  
Inhibitor
Name:
BDBM507668
Synonyms:
US11046682, Compound 40
Type:
Small organic molecule
Emp. Form.:
C23H18N4O2
Mol. Mass.:
382.4146
SMILES:
OCc1cc(ccc1NC(=O)Cc1c(ccc2cncn12)-c1ccccc1)C#N
: