Target
Indoleamine 2,3-dioxygenase 1
Ligand
BDBM507669
Substrate
Meas. Tech.
IDO Enzyme Activity Inhibition Testing
IC50
<250±n/a nM
Citation
 Chen, XGao, Y Fused heterocyclic derivatives, their preparation methods thereof and medical uses thereof US Patent  US11046682 Publication Date 6/29/2021 
Target
Name:
Indoleamine 2,3-dioxygenase 1
Synonyms:
I23O1_HUMAN IDO-1 INDO Indoleamine 2,3-dioxygenase | Indoleamine-pyrrole 2,3-dioxygenase
Type:
Enzyme
Mol. Mass.:
45330.80
Organism:
Homo sapiens (Human)
Description:
P14902
Residue:
403
  
Inhibitor
Name:
BDBM507669
Synonyms:
US11046682, Compound 41
Type:
Small organic molecule
Emp. Form.:
C16H11ClN4O
Mol. Mass.:
310.738
SMILES:
Clc1cc(CC(=O)Nc2ccc(cc2)C#N)n2cncc2c1
: