Target
Indoleamine 2,3-dioxygenase 1
Ligand
BDBM507677
Substrate
Meas. Tech.
IDO Enzyme Activity Inhibition Testing
IC50
<250±n/a nM
Citation
 Chen, XGao, Y Fused heterocyclic derivatives, their preparation methods thereof and medical uses thereof US Patent  US11046682 Publication Date 6/29/2021 
Target
Name:
Indoleamine 2,3-dioxygenase 1
Synonyms:
I23O1_HUMAN IDO-1 INDO Indoleamine 2,3-dioxygenase | Indoleamine-pyrrole 2,3-dioxygenase
Type:
Enzyme
Mol. Mass.:
45330.80
Organism:
Homo sapiens (Human)
Description:
P14902
Residue:
403
  
Inhibitor
Name:
BDBM507677
Synonyms:
US11046682, Compound 52
Type:
Small organic molecule
Emp. Form.:
C27H25N5O2
Mol. Mass.:
451.5197
SMILES:
COCCn1cc(cn1)-c1ccc(NC(=O)Cc2c(ccc3cncn23)-c2ccccc2)cc1
: