Target
Interleukin-1 receptor-associated kinase 4
Ligand
BDBM507699
Substrate
Meas. Tech.
IRAK4 Biochemical Assay
IC50
<1.000±n/a nM
Citation
 Ammann, SBacon, EMBrizgys, GChin, EChou, CCottell, JJNdukwe, MShatskikh, MTaylor, JGWright, NEYang, ZZipfel, SM Thiadiazole IRAK4 compounds US Patent  US11046686 Publication Date 6/29/2021 
Target
Name:
Interleukin-1 receptor-associated kinase 4
Synonyms:
IRAK-4 IRAK4_HUMAN Interleukin-1 receptor-associated kinase 4 (IRAK4) | Renal carcinoma antigen NY-REN-64
Type:
Protein
Mol. Mass.:
51519.08
Organism:
Homo sapiens (Human)
Description:
Q9NWZ3
Residue:
460
  
Inhibitor
Name:
BDBM507699
Synonyms:
(S)-7-(5-(5-(3-hydroxypyrrolidine-1-carbonyl)-1,3,4-thiadiazol-2-yl)-4-(isopropylamino)pyridin-2-yl)pyrrolo[1,2-b]pyridazine-3-carbonitrile(Example 16) US11702414, Example 16
Type:
Small organic molecule
Emp. Form.:
C23H22N8O2S
Mol. Mass.:
474.538
SMILES:
CC(C)Nc1cc(ncc1-c1nnc(s1)C(=O)N1CC[C@H](O)C1)-c1ccc2cc(cnn12)C#N
: