Target
Interleukin-1 receptor-associated kinase 4
Ligand
BDBM507712
Substrate
Meas. Tech.
IRAK4 Biochemical Assay
IC50
1.80±n/a nM
Citation
 Ammann, SBacon, EMBrizgys, GChin, EChou, CCottell, JJNdukwe, MShatskikh, MTaylor, JGWright, NEYang, ZZipfel, SM Thiadiazole IRAK4 compounds US Patent  US11046686 Publication Date 6/29/2021 
Target
Name:
Interleukin-1 receptor-associated kinase 4
Synonyms:
IRAK-4 IRAK4_HUMAN Interleukin-1 receptor-associated kinase 4 (IRAK4) | Renal carcinoma antigen NY-REN-64
Type:
Protein
Mol. Mass.:
51519.08
Organism:
Homo sapiens (Human)
Description:
Q9NWZ3
Residue:
460
  
Inhibitor
Name:
BDBM507712
Synonyms:
7-(4-(isopropylamino)-5-(5-(pyrrolidin-1-yl)-1,3,4-thiadiazol-2-yl)pyridin-2-yl)pyrrolo[1,2-b]pyridazine-3-carbonitrile (Example 29) US11702414, Example 29
Type:
Small organic molecule
Emp. Form.:
C22H22N8S
Mol. Mass.:
430.529
SMILES:
CC(C)Nc1cc(ncc1-c1nnc(s1)N1CCCC1)-c1ccc2cc(cnn12)C#N
: