Target
Dual specificity protein kinase TTK
Ligand
BDBM241198
Substrate
Meas. Tech.
Measurement of Inhibition of MPS1 Kinase
IC50
4.00±n/a nM
Citation
 Hoelder, SBlagg, JSolanki, SWoodward, HNaud, SGBavetsias, VSheldrake, PInnocenti, PCheung, KJAtrash, B Inhibitor compounds US Patent  US11046688 Publication Date 6/29/2021
Target
Name:
Dual specificity protein kinase TTK
Synonyms:
Dual specificity protein kinase (TTK) MPS1 Monopolar Spindle 1 (MPS1) Monopolar Spindle 1 Kinase (MPS1) TTK | TTK_HUMAN
Type:
Protein
Mol. Mass.:
97086.79
Organism:
Homo sapiens (Human)
Description:
P33981
Residue:
857
  
Inhibitor
Name:
BDBM241198
Synonyms:
US11046688, Example 40 | US9409907, 40
Type:
Small organic molecule
Emp. Form.:
C23H22N8O
Mol. Mass.:
426.4738
SMILES:
COc1cc(ccc1Nc1ncc2ccnc(-c3cnn(C)c3)c2n1)-c1cnc(C)n1C
: