Target
Dual specificity protein kinase TTK
Ligand
BDBM241345
Substrate
Meas. Tech.
Measurement of Inhibition of MPS1 Kinase
IC50
1.000±n/a nM
Citation
 Hoelder, SBlagg, JSolanki, SWoodward, HNaud, SGBavetsias, VSheldrake, PInnocenti, PCheung, KJAtrash, B Inhibitor compounds US Patent  US11046688 Publication Date 6/29/2021
Target
Name:
Dual specificity protein kinase TTK
Synonyms:
Dual specificity protein kinase (TTK) MPS1 Monopolar Spindle 1 (MPS1) Monopolar Spindle 1 Kinase (MPS1) TTK | TTK_HUMAN
Type:
Protein
Mol. Mass.:
97086.79
Organism:
Homo sapiens (Human)
Description:
P33981
Residue:
857
  
Inhibitor
Name:
BDBM241345
Synonyms:
US10479788, Example 189 US9409907, 189
Type:
Small organic molecule
Emp. Form.:
C24H28N8O2
Mol. Mass.:
460.5315
SMILES:
CCOc1cc(ccc1Nc1ncc2ccnc(NCC3(C)CCOC3)c2n1)-c1nncn1C
: