Target
Estrogen receptor
Ligand
BDBM361460
Substrate
Meas. Tech.
ERalpha Binding Assay
IC50
0.580±n/a nM
Citation
 Nissink, JWScott, JSMoss, TAHughes, SJBarlaam, BCYang, B Selective estrogen receptor down-regulators US Patent  US11046689 Publication Date 6/29/2021 
Target
Name:
Estrogen receptor
Synonyms:
ER ESR ESR1_HUMAN Estrogen receptor Estrogen receptor (ER-alpha) Estrogen receptor alpha (ER) Nuclear receptor subfamily 3 group A member 1
Type:
Protein
Mol. Mass.:
66230.44
Organism:
Homo sapiens (Human)
Description:
P03372
Residue:
595
  
Inhibitor
Name:
BDBM361460
Synonyms:
3-fluoro-N-(2- (3-((1R,3R)-2- ((1- fluorocyclopropyl) methyl)-3- methyl- 2,3,4,9- tetrahydro-1H- pyrido[3,4- b]indol-1-yl)- 4- methoxyphenoxy) ethyl)propan- 1-amine US10590132, Example 52 | US11046689, Example 52
Type:
Small organic molecule
Emp. Form.:
C28H35F2N3O2
Mol. Mass.:
483.5932
SMILES:
COc1ccc(OCCNCCCF)cc1[C@H]1N(CC2(F)CC2)[C@H](C)Cc2c1[nH]c1ccccc21
: