Target
Estrogen receptor
Ligand
BDBM361490
Substrate
Meas. Tech.
ERalpha Binding Assay
IC50
0.800±n/a nM
Citation
 Nissink, JWScott, JSMoss, TAHughes, SJBarlaam, BCYang, B Selective estrogen receptor down-regulators US Patent  US11046689 Publication Date 6/29/2021 
Target
Name:
Estrogen receptor
Synonyms:
ER ESR ESR1_HUMAN Estrogen receptor Estrogen receptor (ER-alpha) Estrogen receptor alpha (ER) Nuclear receptor subfamily 3 group A member 1
Type:
Protein
Mol. Mass.:
66230.44
Organism:
Homo sapiens (Human)
Description:
P03372
Residue:
595
  
Inhibitor
Name:
BDBM361490
Synonyms:
N-(2-(3- ((1R,3R)-2- (2,2- difluoroethyl)- 3-methyl- 2,3,4,9- tetrahydro-1H- pyrido[3,4- b]indol-1-yl)- 2-fluoro-4- methoxyphenoxy) ethyl)-3- fluoropropan- 1-amine US11046689, Example 82
Type:
Small organic molecule
Emp. Form.:
C26H31F4N3O2
Mol. Mass.:
493.5369
SMILES:
COc1ccc(OCCNCCCF)c(F)c1[C@H]1N(CC(F)F)[C@H](C)Cc2c1[nH]c1ccccc21
: