Target
Estrogen receptor
Ligand
BDBM361554
Substrate
Meas. Tech.
ERalpha Binding Assay
IC50
1.10±n/a nM
Citation
 Nissink, JWScott, JSMoss, TAHughes, SJBarlaam, BCYang, B Selective estrogen receptor down-regulators US Patent  US11046689 Publication Date 6/29/2021 
Target
Name:
Estrogen receptor
Synonyms:
ER ESR ESR1_HUMAN Estrogen receptor Estrogen receptor (ER-alpha) Estrogen receptor alpha (ER) Nuclear receptor subfamily 3 group A member 1
Type:
Protein
Mol. Mass.:
66230.44
Organism:
Homo sapiens (Human)
Description:
P03372
Residue:
595
  
Inhibitor
Name:
BDBM361554
Synonyms:
(S)-3-((1R,3R)- 6-fluoro-1-(6- fluoro-3-(2- ((3- fluoropropyl) (methyl)amino) ethoxy)-2- methylphenyl)- 3-methyl- 1,3,4,9- tetrahydro-2H- pyrido[3,4- b]indol-2-yl)- 2- methylpropanoic acid US10590132, Example 146 | US11046689, Example 146
Type:
Small organic molecule
Emp. Form.:
C29H36F3N3O3
Mol. Mass.:
531.6096
SMILES:
C[C@@H](CN1[C@H](C)Cc2c([nH]c3ccc(F)cc23)[C@H]1c1c(F)ccc(OCCN(C)CCCF)c1C)C(O)=O
: