Target
S-adenosylmethionine synthase isoform type-2
Ligand
BDBM507723
Substrate
Meas. Tech.
Malachite Green Assay
IC50
<200±n/a nM
Citation
 Alam, MCleary, LFleury, MPei, ZSteel, RSutton, JKnox, JENewby, ZE 2-oxoquinazoline derivatives as methionine adenosyltransferase 2A inhibitors US Patent  US11046691 Publication Date 6/29/2021 
Target
Name:
S-adenosylmethionine synthase isoform type-2
Synonyms:
AMS2 MAT 2 MAT2A METK2_HUMAN Methionine adenosyltransferase II
Type:
Protein
Mol. Mass.:
43659.65
Organism:
Human
Description:
P31153
Residue:
395
  
Inhibitor
Name:
BDBM507723
Synonyms:
4-azetidinyl-7-chloro-1-(5-fluoro-3- hydroxy-phenyl)hydroquinazolin-2-one US11084798, Cpd No 38 | US11130759, Cpd. No. 38
Type:
Small organic molecule
Emp. Form.:
C17H13ClFN3O2
Mol. Mass.:
345.755
SMILES:
Oc1cc(F)cc(c1)-n1c2cc(Cl)ccc2c(nc1=O)N1CCC1
: