Target
S-adenosylmethionine synthase isoform type-2
Ligand
BDBM507740
Substrate
Meas. Tech.
Malachite Green Assay
IC50
<200±n/a nM
Citation
 Alam, MCleary, LFleury, MPei, ZSteel, RSutton, JKnox, JENewby, ZE 2-oxoquinazoline derivatives as methionine adenosyltransferase 2A inhibitors US Patent  US11046691 Publication Date 6/29/2021 
Target
Name:
S-adenosylmethionine synthase isoform type-2
Synonyms:
AMS2 MAT 2 MAT2A METK2_HUMAN Methionine adenosyltransferase II
Type:
Protein
Mol. Mass.:
43659.65
Organism:
Human
Description:
P31153
Residue:
395
  
Inhibitor
Name:
BDBM507740
Synonyms:
7-chloro-4-(methylamino)-1-pyrimidin- 2-yl-quinazolin-2(1H)-one US11084798, Cpd No 11 | US11130759, Cpd. No. 11
Type:
Small organic molecule
Emp. Form.:
C13H10ClN5O
Mol. Mass.:
287.704
SMILES:
CNc1nc(=O)n(-c2ncccn2)c2cc(Cl)ccc12
: