Target
S-adenosylmethionine synthase isoform type-2
Ligand
BDBM507785
Substrate
Meas. Tech.
Phosphate Sensor Fluorescence Assay
IC50
<200±n/a nM
Citation
 Alam, MCleary, LFleury, MPei, ZSteel, RSutton, JKnox, JENewby, ZE 2-oxoquinazoline derivatives as methionine adenosyltransferase 2A inhibitors US Patent  US11046691 Publication Date 6/29/2021 
Target
Name:
S-adenosylmethionine synthase isoform type-2
Synonyms:
AMS2 MAT 2 MAT2A METK2_HUMAN Methionine adenosyltransferase II
Type:
Protein
Mol. Mass.:
43659.65
Organism:
Human
Description:
P31153
Residue:
395
  
Inhibitor
Name:
BDBM507785
Synonyms:
7-bromo-6-chloro-1-(2-chlorophenyl)- 4-(isoxazol-4-ylamino)hydroquinazolin- 2-one US11084798, Cpd No 412 | US11130759, Cpd. No. 412
Type:
Small organic molecule
Emp. Form.:
C17H9BrCl2N4O2
Mol. Mass.:
452.089
SMILES:
Clc1cc2c(Nc3cnoc3)nc(=O)n(-c3ccccc3Cl)c2cc1Br
: