Target
S-adenosylmethionine synthase isoform type-2
Ligand
BDBM508002
Substrate
Meas. Tech.
Phosphate Sensor Fluorescence Assay
IC50
<200±n/a nM
Citation
 Alam, MCleary, LFleury, MPei, ZSteel, RSutton, JKnox, JENewby, ZE 2-oxoquinazoline derivatives as methionine adenosyltransferase 2A inhibitors US Patent  US11046691 Publication Date 6/29/2021 
Target
Name:
S-adenosylmethionine synthase isoform type-2
Synonyms:
AMS2 MAT 2 MAT2A METK2_HUMAN Methionine adenosyltransferase II
Type:
Protein
Mol. Mass.:
43659.65
Organism:
Human
Description:
P31153
Residue:
395
  
Inhibitor
Name:
BDBM508002
Synonyms:
7-cyclopropyl-4-(3-hydroxyazetidin-1- yl)-1-phenylhydroquinazolin-2-one US11084798, Cpd No 372 | US11130759, Cpd. No. 372
Type:
Small organic molecule
Emp. Form.:
C20H19N3O2
Mol. Mass.:
333.3838
SMILES:
OC1CN(C1)c1nc(=O)n(-c2ccccc2)c2cc(ccc12)C1CC1
: