Target
S-adenosylmethionine synthase isoform type-2
Ligand
BDBM508019
Substrate
Meas. Tech.
Phosphate Sensor Fluorescence Assay
IC50
<200±n/a nM
Citation
 Alam, MCleary, LFleury, MPei, ZSteel, RSutton, JKnox, JENewby, ZE 2-oxoquinazoline derivatives as methionine adenosyltransferase 2A inhibitors US Patent  US11046691 Publication Date 6/29/2021 
Target
Name:
S-adenosylmethionine synthase isoform type-2
Synonyms:
AMS2 MAT 2 MAT2A METK2_HUMAN Methionine adenosyltransferase II
Type:
Protein
Mol. Mass.:
43659.65
Organism:
Human
Description:
P31153
Residue:
395
  
Inhibitor
Name:
BDBM508019
Synonyms:
1-(2-chlorophenyl)-4-(((1s,3s)-3- methoxycyclobutyl)amino)-7-(trifluoro- methyl)pyrido[2,3-d]pyrimidin-2(1H)- one US11084798, Cpd No 270 | US11130759, Cpd. No. 270
Type:
Small organic molecule
Emp. Form.:
C19H16ClF3N4O2
Mol. Mass.:
424.804
SMILES:
CO[C@@H]1C[C@@H](C1)Nc1nc(=O)n(-c2ccccc2Cl)c2nc(ccc12)C(F)(F)F
: