Target
Proto-oncogene tyrosine-protein kinase receptor Ret
Ligand
BDBM508562
Substrate
Meas. Tech.
Measurement of Inhibitory Activity Against RET (In Vitro)
IC50
0.200±n/a nM
Citation
 Miyazaki, IShimamura, TKato, MFujita, HIguchi, S Fused pyrimidine compound or salt thereof US Patent  US11046696 Publication Date 6/29/2021 
Target
Name:
Proto-oncogene tyrosine-protein kinase receptor Ret
Synonyms:
CDHF12 Cadherin family member 12 Proto-oncogene c-Ret RET51 Tyrosine-protein kinase Ret (RET)
Type:
Protein
Mol. Mass.:
124318.29
Organism:
Homo sapiens (Human)
Description:
P07949
Residue:
1114
  
Inhibitor
Name:
BDBM508562
Synonyms:
US11046696, Compound 112
Type:
Small organic molecule
Emp. Form.:
C28H30N4O3
Mol. Mass.:
470.5628
SMILES:
COCc1ccc(CC(=O)c2c(C#CC3CCC(=O)CC3)n(c3ncnc(N)c23)C2(C)CC2)cc1
: