Target
Proto-oncogene tyrosine-protein kinase receptor Ret [V804M]
Ligand
BDBM311700
Substrate
Meas. Tech.
Measurement of Inhibitory Activity Against RET (In Vitro)
IC50
0.300±n/a nM
Citation
 Miyazaki, IShimamura, TKato, MFujita, HIguchi, S Fused pyrimidine compound or salt thereof US Patent  US11046696 Publication Date 6/29/2021 
Target
Name:
Proto-oncogene tyrosine-protein kinase receptor Ret [V804M]
Synonyms:
CDHF12 PTC RET RET51 ret enzyme (v804m)
Type:
Enzyme Catalytic Domain
Mol. Mass.:
124350.36
Organism:
Homo sapiens (Human)
Description:
P07949[V804M]
Residue:
1114
  
Inhibitor
Name:
BDBM311700
Synonyms:
Ex. Cpd. 152 US11046696, Compound 152
Type:
Small organic molecule
Emp. Form.:
C27H31N5O3
Mol. Mass.:
473.5667
SMILES:
COCc1ccc(NC(=O)c2c(C#CCC3CCOCC3)n(c3ncnc(N)c23)C2(C)CC2)cc1
: