Target
Non-receptor tyrosine-protein kinase TYK2 [556-888]
Ligand
BDBM423666
Substrate
Meas. Tech.
TYK2 JH2 Domain Binding Assay
Kd
<0.2±n/a nM
Citation
 Masse, CEGreenwood, JRMondal, SCowen, SDMcLean, TH TYK2 inhibitors and uses thereof US Patent  US11046698 Publication Date 6/29/2021 
Target
Name:
Non-receptor tyrosine-protein kinase TYK2 [556-888]
Synonyms:
Non-receptor tyrosine-protein kinase TYK2 (G556-D888) TYK2 TYK2_HUMAN
Type:
Protein
Mol. Mass.:
36941.98
Organism:
Homo sapiens (Human)
Description:
P29597 (aa 556-888)
Residue:
333
  
Inhibitor
Name:
BDBM423666
Synonyms:
US10508120, Compound I-121 US11046698, Compound I-121
Type:
Small organic molecule
Emp. Form.:
C27H29N9O3
Mol. Mass.:
527.5777
SMILES:
CNc1cc(Nc2cccn(-c3ccc(cn3)C(=O)N3CCCC3)c2=O)nc2c(cnn12)C(=O)NC1CCC1
: