Target
Non-receptor tyrosine-protein kinase TYK2 [556-888]
Ligand
BDBM424336
Substrate
Meas. Tech.
TYK2 JH2 Domain Binding Assay
Kd
0.6±n/a nM
Citation
 Masse, CEGreenwood, JRMondal, SCowen, SDMcLean, TH TYK2 inhibitors and uses thereof US Patent  US11046698 Publication Date 6/29/2021 
Target
Name:
Non-receptor tyrosine-protein kinase TYK2 [556-888]
Synonyms:
Non-receptor tyrosine-protein kinase TYK2 (G556-D888) TYK2 TYK2_HUMAN
Type:
Protein
Mol. Mass.:
36941.98
Organism:
Homo sapiens (Human)
Description:
P29597 (aa 556-888)
Residue:
333
  
Inhibitor
Name:
BDBM424336
Synonyms:
US10508120, Compound I-791 US10577373, Compound I-856 | US11046698, Compound I-791
Type:
Small organic molecule
Emp. Form.:
C25H30N8O4
Mol. Mass.:
506.5569
SMILES:
CNc1cc(nc2c(cnn12)C(=O)N[C@H]1COC[C@H]1O)-c1cn(CCN2CCOCC2)c2ncccc12
: