Target
Non-receptor tyrosine-protein kinase TYK2 [556-888]
Ligand
BDBM424408
Substrate
Meas. Tech.
TYK2 JH2 Domain Binding Assay
Kd
<0.2±n/a nM
Citation
 Masse, CEGreenwood, JRMondal, SCowen, SDMcLean, TH TYK2 inhibitors and uses thereof US Patent  US11046698 Publication Date 6/29/2021 
Target
Name:
Non-receptor tyrosine-protein kinase TYK2 [556-888]
Synonyms:
Non-receptor tyrosine-protein kinase TYK2 (G556-D888) TYK2 TYK2_HUMAN
Type:
Protein
Mol. Mass.:
36941.98
Organism:
Homo sapiens (Human)
Description:
P29597 (aa 556-888)
Residue:
333
  
Inhibitor
Name:
BDBM424408
Synonyms:
US10508120, Compound I-863 US10577373, Compound I-904 US11414431, Compound I-266
Type:
Small organic molecule
Emp. Form.:
C23H23FN8O3
Mol. Mass.:
478.4789
SMILES:
CNc1cc(Nc2cccn(-c3ncccc3F)c2=O)nc2c(cnn12)C(=O)N[C@@H]1CC[C@H]1OC
: