Target
Metabotropic glutamate receptor 5
Ligand
BDBM292287
Substrate
Meas. Tech.
Calcium Influx Assay Based on Fluorescence
EC50
300±n/a nM
Citation
 Park, CEJang, YKShin, YJKim, JYHam, SMKim, YGMin, HKCha, SBJung, HJLee, JYHan, SNChung, JYChoi, EJJoung, CMPark, JSLee, JWCho, NRRyu, EJMaeng, CY Imidazopyrimidine and imidazotriazine derivative, and pharmaceutical composition comprising the same US Patent  US11046702 Publication Date 6/29/2021 
Target
Name:
Metabotropic glutamate receptor 5
Synonyms:
GPRC1E GRM5_HUMAN metabotropic glutamate 5 | metabotropic glutamate 5a
Type:
Enzyme
Mol. Mass.:
132484.72
Organism:
Homo sapiens (Human)
Description:
Residue:
1212
  
Inhibitor
Name:
BDBM292287
Synonyms:
US10100057, Example 142 US9745310, Example 142
Type:
Small organic molecule
Emp. Form.:
C20H15F3N4O2
Mol. Mass.:
400.3539
SMILES:
OCc1cc(ccc1-c1cnc2nc(COc3ccccn3)cn2c1)C(F)(F)F
: