Target
Metabotropic glutamate receptor 5
Ligand
BDBM292292
Substrate
Meas. Tech.
Calcium Influx Assay Based on Fluorescence
EC50
750±n/a nM
Citation
 Park, CEJang, YKShin, YJKim, JYHam, SMKim, YGMin, HKCha, SBJung, HJLee, JYHan, SNChung, JYChoi, EJJoung, CMPark, JSLee, JWCho, NRRyu, EJMaeng, CY Imidazopyrimidine and imidazotriazine derivative, and pharmaceutical composition comprising the same US Patent  US11046702 Publication Date 6/29/2021 
Target
Name:
Metabotropic glutamate receptor 5
Synonyms:
GPRC1E GRM5_HUMAN metabotropic glutamate 5 | metabotropic glutamate 5a
Type:
Enzyme
Mol. Mass.:
132484.72
Organism:
Homo sapiens (Human)
Description:
Residue:
1212
  
Inhibitor
Name:
BDBM292292
Synonyms:
US10100057, Example 147 US9745310, Example 147
Type:
Small organic molecule
Emp. Form.:
C19H15FN4O2
Mol. Mass.:
350.3464
SMILES:
COc1cc(F)ccc1-c1cnc2nc(COc3cccnc3)cn2c1
: