Target
Alkaline phosphatase, tissue-nonspecific isozyme
Ligand
BDBM508474
Substrate
Meas. Tech.
Inhibitory Test of TNAP Activity
IC50
5.10±n/a nM
Citation
 Miyazaki, SInui, MKurosaki, YYamamoto, YIzumi, MSoma, KPinkerton, AKishida, M Sulfonamide compounds US Patent  US11046710 Publication Date 6/29/2021 
Target
Name:
Alkaline phosphatase, tissue-nonspecific isozyme
Synonyms:
ALPL tissue-nonspecific alkaline phosphatase precursor
Type:
PROTEIN
Mol. Mass.:
57306.17
Organism:
Homo sapiens (Human)
Description:
ChEMBL_1448917
Residue:
524
  
Inhibitor
Name:
BDBM508474
Synonyms:
US11046710, Example 13
Type:
Small organic molecule
Emp. Form.:
C17H16ClN5O4S
Mol. Mass.:
421.858
SMILES:
CCOc1ncc(Cl)cc1S(=O)(=O)Nc1cnc2OCCn3nccc3-c2c1
: