Target
Alkaline phosphatase, tissue-nonspecific isozyme
Ligand
BDBM508485
Substrate
Meas. Tech.
Inhibitory Test of TNAP Activity
IC50
1.20±n/a nM
Citation
 Miyazaki, SInui, MKurosaki, YYamamoto, YIzumi, MSoma, KPinkerton, AKishida, M Sulfonamide compounds US Patent  US11046710 Publication Date 6/29/2021 
Target
Name:
Alkaline phosphatase, tissue-nonspecific isozyme
Synonyms:
ALPL tissue-nonspecific alkaline phosphatase precursor
Type:
PROTEIN
Mol. Mass.:
57306.17
Organism:
Homo sapiens (Human)
Description:
ChEMBL_1448917
Residue:
524
  
Inhibitor
Name:
BDBM508485
Synonyms:
US11046710, Example 28
Type:
Small organic molecule
Emp. Form.:
C18H18ClN3O5S
Mol. Mass.:
423.871
SMILES:
COc1ccc(Cl)cc1S(=O)(=O)Nc1cnc2OC[C@H]3CCCN3C(=O)c2c1
: