Target
Alkaline phosphatase, tissue-nonspecific isozyme
Ligand
BDBM508486
Substrate
Meas. Tech.
Inhibitory Test of TNAP Activity
IC50
7.10±n/a nM
Citation
 Miyazaki, SInui, MKurosaki, YYamamoto, YIzumi, MSoma, KPinkerton, AKishida, M Sulfonamide compounds US Patent  US11046710 Publication Date 6/29/2021 
Target
Name:
Alkaline phosphatase, tissue-nonspecific isozyme
Synonyms:
ALPL tissue-nonspecific alkaline phosphatase precursor
Type:
PROTEIN
Mol. Mass.:
57306.17
Organism:
Homo sapiens (Human)
Description:
ChEMBL_1448917
Residue:
524
  
Inhibitor
Name:
BDBM508486
Synonyms:
US11046710, Example 29
Type:
Small organic molecule
Emp. Form.:
C18H18ClN3O6S
Mol. Mass.:
439.87
SMILES:
COc1ccc(Cl)cc1S(=O)(=O)Nc1cnc2OC[C@@H]3C[C@@H](O)CN3C(=O)c2c1
: