Target
Alkaline phosphatase, tissue-nonspecific isozyme
Ligand
BDBM508507
Substrate
Meas. Tech.
Inhibitory Test of TNAP Activity
IC50
1.40±n/a nM
Citation
 Miyazaki, SInui, MKurosaki, YYamamoto, YIzumi, MSoma, KPinkerton, AKishida, M Sulfonamide compounds US Patent  US11046710 Publication Date 6/29/2021 
Target
Name:
Alkaline phosphatase, tissue-nonspecific isozyme
Synonyms:
ALPL tissue-nonspecific alkaline phosphatase precursor
Type:
PROTEIN
Mol. Mass.:
57306.17
Organism:
Homo sapiens (Human)
Description:
ChEMBL_1448917
Residue:
524
  
Inhibitor
Name:
BDBM508507
Synonyms:
5-chloro-N-[(8S,9aS)-8-hydroxy-7-oxo-8,9,9a,10-tetrahydro-5H,7H-pyrido[3,2-f]pyrrolo[2,1-c][1,4]oxazepin-3-yl]-2-(trifluoromethoxy)benzenesulfonamide | US11046710, Example 56
Type:
Small organic molecule
Emp. Form.:
C18H15ClF3N3O6S
Mol. Mass.:
493.841
SMILES:
O[C@H]1C[C@H]2COc3ncc(NS(=O)(=O)c4cc(Cl)ccc4OC(F)(F)F)cc3CN2C1=O
: