Target
Protein O-GlcNAcase
Ligand
BDBM508576
Substrate
Meas. Tech.
Human O-GlcNAcase Enzyme Inhibition Assay
IC50
<50±n/a nM
Citation
 Quattropani, AKulkarni, SSGiri, AG Glycosidase inhibitors US Patent  US11046712 Publication Date 6/29/2021 
Target
Name:
Protein O-GlcNAcase
Synonyms:
2-acetamido-2-deoxy-β-D-glucopyranosidase (O-GlcNAcase) Beta-hexosaminidase (O-GlcNAcase) HEXC MEA5 N-acetyl-beta-D-glucosaminidase (O-GlcNAcase) OGA Protein O-GlcNAcase
Type:
Enzyme
Mol. Mass.:
102874.67
Organism:
Homo sapiens (Human)
Description:
O60502
Residue:
916
  
Inhibitor
Name:
BDBM508576
Synonyms:
US11046712, No 56
Type:
Small organic molecule
Emp. Form.:
C18H22N4O3S
Mol. Mass.:
374.457
SMILES:
CNC(=O)c1csc(n1)N1CCN(CC1)[C@@H](C)c1ccc2OCOc2c1
: