Target
Protein O-GlcNAcase
Ligand
BDBM508594
Substrate
Meas. Tech.
Human O-GlcNAcase Enzyme Inhibition Assay
IC50
<50±n/a nM
Citation
 Quattropani, AKulkarni, SSGiri, AG Glycosidase inhibitors US Patent  US11046712 Publication Date 6/29/2021 
Target
Name:
Protein O-GlcNAcase
Synonyms:
2-acetamido-2-deoxy-β-D-glucopyranosidase (O-GlcNAcase) Beta-hexosaminidase (O-GlcNAcase) HEXC MEA5 N-acetyl-beta-D-glucosaminidase (O-GlcNAcase) OGA Protein O-GlcNAcase
Type:
Enzyme
Mol. Mass.:
102874.67
Organism:
Homo sapiens (Human)
Description:
O60502
Residue:
916
  
Inhibitor
Name:
BDBM508594
Synonyms:
(R)-(2-(4-(1-(2,3-dihydrobenzorbiri,41dioxin-6-yl)ethyl)piperazin-1-yl)thiazol-5-yl)(4-methylpiperazin-1-vPmethanone and (S)-(2-(4-(1-(2,3-dihydrobenzorbiri{circumflex over ( )}dioxin-6-yl)ethyl)piperazin-1-yl)thiazol-5-yl)(4-methylpiperazin-1-vQmethanone US11046712, No 75
Type:
Small organic molecule
Emp. Form.:
C23H31N5O3S
Mol. Mass.:
457.589
SMILES:
C[C@H](N1CCN(CC1)c1ncc(s1)C(=O)N1CCN(C)CC1)c1ccc2OCCOc2c1
: