Target
Protein O-GlcNAcase
Ligand
BDBM408187
Substrate
Meas. Tech.
Human O-GlcNAcase Enzyme Inhibition Assay
IC50
125±n/a nM
Citation
 Quattropani, AKulkarni, SSGiri, AG Glycosidase inhibitors US Patent  US11046712 Publication Date 6/29/2021 
Target
Name:
Protein O-GlcNAcase
Synonyms:
2-acetamido-2-deoxy-β-D-glucopyranosidase (O-GlcNAcase) Beta-hexosaminidase (O-GlcNAcase) HEXC MEA5 N-acetyl-beta-D-glucosaminidase (O-GlcNAcase) OGA Protein O-GlcNAcase
Type:
Enzyme
Mol. Mass.:
102874.67
Organism:
Homo sapiens (Human)
Description:
O60502
Residue:
916
  
Inhibitor
Name:
BDBM408187
Synonyms:
7-(1-(4-(pyrimidin-2-yl)piperazin-1-yl)ethyl)quinoline US11046712, No 91
Type:
Small organic molecule
Emp. Form.:
C19H21N5
Mol. Mass.:
319.4035
SMILES:
CC(N1CCN(CC1)c1ncccn1)c1ccc2cccnc2c1
: