Target
Protein O-GlcNAcase
Ligand
BDBM508617
Substrate
Meas. Tech.
Human O-GlcNAcase Enzyme Inhibition Assay
IC50
<50±n/a nM
Citation
 Quattropani, AKulkarni, SSGiri, AG Glycosidase inhibitors US Patent  US11046712 Publication Date 6/29/2021 
Target
Name:
Protein O-GlcNAcase
Synonyms:
2-acetamido-2-deoxy-β-D-glucopyranosidase (O-GlcNAcase) Beta-hexosaminidase (O-GlcNAcase) HEXC MEA5 N-acetyl-beta-D-glucosaminidase (O-GlcNAcase) OGA Protein O-GlcNAcase
Type:
Enzyme
Mol. Mass.:
102874.67
Organism:
Homo sapiens (Human)
Description:
O60502
Residue:
916
  
Inhibitor
Name:
BDBM508617
Synonyms:
US11046712, No 97
Type:
Small organic molecule
Emp. Form.:
C18H25N5O3S
Mol. Mass.:
391.488
SMILES:
CC(N1CCN(CC1)C(=N)SC(=N)NC(C)=O)c1ccc2OCCOc2c1
: