Target
Protein O-GlcNAcase
Ligand
BDBM408221
Substrate
Meas. Tech.
Human O-GlcNAcase Enzyme Inhibition Assay
IC50
5500±n/a nM
Citation
 Quattropani, AKulkarni, SSGiri, AG Glycosidase inhibitors US Patent  US11046712 Publication Date 6/29/2021 
Target
Name:
Protein O-GlcNAcase
Synonyms:
2-acetamido-2-deoxy-β-D-glucopyranosidase (O-GlcNAcase) Beta-hexosaminidase (O-GlcNAcase) HEXC MEA5 N-acetyl-beta-D-glucosaminidase (O-GlcNAcase) OGA Protein O-GlcNAcase
Type:
Enzyme
Mol. Mass.:
102874.67
Organism:
Homo sapiens (Human)
Description:
O60502
Residue:
916
  
Inhibitor
Name:
BDBM408221
Synonyms:
N-(2-(4-(1-(3-chloroquinolin-7-yl)ethyl)piperazin-1-yl)pyrimidin-5-yl)acetamide US11046712, No 125
Type:
Small organic molecule
Emp. Form.:
C21H23ClN6O
Mol. Mass.:
410.9
SMILES:
CC(N1CCN(CC1)c1ncc(NC(C)=O)cn1)c1ccc2cc(Cl)cnc2c1
: