Target
Protein O-GlcNAcase
Ligand
BDBM408222
Substrate
Meas. Tech.
Human O-GlcNAcase Enzyme Inhibition Assay
IC50
600±n/a nM
Citation
 Quattropani, AKulkarni, SSGiri, AG Glycosidase inhibitors US Patent  US11046712 Publication Date 6/29/2021 
Target
Name:
Protein O-GlcNAcase
Synonyms:
2-acetamido-2-deoxy-β-D-glucopyranosidase (O-GlcNAcase) Beta-hexosaminidase (O-GlcNAcase) HEXC MEA5 N-acetyl-beta-D-glucosaminidase (O-GlcNAcase) OGA Protein O-GlcNAcase
Type:
Enzyme
Mol. Mass.:
102874.67
Organism:
Homo sapiens (Human)
Description:
O60502
Residue:
916
  
Inhibitor
Name:
BDBM408222
Synonyms:
N-(2-(4-(1-(3,4-dihydro-2H-benzo[b][1,4]dioxepin-7-yl)ethyl)piperazin-1-yl)pyrimidin-5-yl)acetamide US11046712, No 126
Type:
Small organic molecule
Emp. Form.:
C21H27N5O3
Mol. Mass.:
397.4708
SMILES:
CC(N1CCN(CC1)c1ncc(NC(C)=O)cn1)c1ccc2OCCCOc2c1
: