Target
Protein O-GlcNAcase
Ligand
BDBM408266
Substrate
Meas. Tech.
Human O-GlcNAcase Enzyme Inhibition Assay
IC50
<50±n/a nM
Citation
 Quattropani, AKulkarni, SSGiri, AG Glycosidase inhibitors US Patent  US11046712 Publication Date 6/29/2021 
Target
Name:
Protein O-GlcNAcase
Synonyms:
2-acetamido-2-deoxy-β-D-glucopyranosidase (O-GlcNAcase) Beta-hexosaminidase (O-GlcNAcase) HEXC MEA5 N-acetyl-beta-D-glucosaminidase (O-GlcNAcase) OGA Protein O-GlcNAcase
Type:
Enzyme
Mol. Mass.:
102874.67
Organism:
Homo sapiens (Human)
Description:
O60502
Residue:
916
  
Inhibitor
Name:
BDBM408266
Synonyms:
(S)-2-(6-(4-(1-(benzo[d][1,3]dioxol-5-yl)ethyl)piperazin-1-yl)pyridin-3-yl)propan-2-ol US11046712, No 190
Type:
Small organic molecule
Emp. Form.:
C21H27N3O3
Mol. Mass.:
369.4574
SMILES:
C[C@H](N1CCN(CC1)c1ccc(cn1)C(C)(C)O)c1ccc2OCOc2c1
: